BDBM50404652 CHEMBL2114367
SMILES CCCCCC[C@H]([C@@H](C)O)n1cnc2c(N)ncnc12
InChI Key InChIKey=IOSAAWHGJUZBOG-GHMZBOCLSA-N
Data  1 KI
PDB links: 2 PDB IDs match this monomer.
  Tab Delimited (TSV)   2D SDfile   Computed 3D by Vconf -m prep SDfile
Find this compound or compounds like it in BindingDB:
Activity Spreadsheet -- Enzyme Inhibition Constant Data from BindingDB
Found 1 hit for monomerid = 50404652
TargetAdenosine deaminase(Homo sapiens (Human))
TBA
Curated by ChEMBL
LigandPNGBDBM50404652(CHEMBL2114367)
Affinity DataKi:  122nM. Assay description: Compound was evaluated for the inhibition of adenosine deaminase