BDBM50404751 CHEMBL31772
SMILES CCOC(=O)CCNCC(O)COc1ccccc1
InChI Key InChIKey=BGDSCKIMCCCOPQ-UHFFFAOYSA-N
Data  2 Kd
  Tab Delimited (TSV)   2D SDfile   Computed 3D by Vconf -m prep SDfile
Find this compound or compounds like it in BindingDB:
Activity Spreadsheet -- Enzyme Inhibition Constant Data from BindingDB
Found 2 hits for monomerid = 50404751
TargetBeta-2 adrenergic receptor(GUINEA PIG)
TBA
Curated by ChEMBL
LigandPNGBDBM50404751(CHEMBL31772)
Affinity DataKd:  1.26E+3nM. Assay description: In vitro ability to block beta-2 adrenergic receptor in guinea pig trachea.
In DepthDetails ArticlePubMed
TargetBeta-1 adrenergic receptor(GUINEA PIG)
TBA
Curated by ChEMBL
LigandPNGBDBM50404751(CHEMBL31772)
Affinity DataKd:  50nM. Assay description: In vitro ability to block beta-1 adrenergic receptor in guinea pig right atria.
In DepthDetails ArticlePubMed