BDBM50404830 CHEMBL312094
SMILES OC(=O)[C@H](Cc1ccccc1)NC(=O)CCS
InChI Key InChIKey=XGAOFGPISXHGSA-JTQLQIEISA-N
Data  1 IC50
  Tab Delimited (TSV)   2D SDfile   Computed 3D by Vconf -m prep SDfile
Find this compound or compounds like it in BindingDB:
Activity Spreadsheet -- Enzyme Inhibition Constant Data from BindingDB
Found 1 hit for monomerid = 50404830
TargetAngiotensin-converting enzyme(Homo sapiens (Human))
Washington University
Curated by ChEMBL
LigandPNGBDBM50404830(CHEMBL312094)
Affinity DataIC50:  427nM. Assay description: Inhibitory activity against angiotensin converting enzyme (ACE)
In DepthDetails ArticlePubMed