BDBM50405539 CHEMBL2052024
SMILES C[C@H](N[C@@H](CCc1ccccc1)C(O)=O)C(=O)N1C2CCCCC2C[C@@H]1C(O)=O
InChI Key InChIKey=AHYHTSYNOHNUSH-NFKPGXHRSA-N
Data  1 IC50
  Tab Delimited (TSV)   2D SDfile   Computed 3D by Vconf -m prep SDfile
Find this compound or compounds like it in BindingDB:
Activity Spreadsheet -- Enzyme Inhibition Constant Data from BindingDB
Found 1 hit for monomerid = 50405539
TargetAngiotensin-converting enzyme(Rattus norvegicus)
TBA
Curated by ChEMBL
LigandPNGBDBM50405539(CHEMBL2052024)
Affinity DataIC50:  18nM. Assay description: Inhibition of rat Angiotensin I converting enzyme (ACE), using Hip-Gly-Gly as synthetic substrate.
In DepthDetails ArticlePubMed