BDBM50405638 CHEMBL2114113::CHEMBL3348524
SMILES CC(C)C[C@H](O)[C@@H](O)[C@H](CC1CCCCC1)NC(=O)[C@H](Cc1c[nH]cn1)NC(=O)[C@H](Cc1ccccc1)NC(=O)OC(C)(C)C
InChI Key InChIKey=RRTBHYJKYDWRDY-MYSYHGOYSA-N
Data  1 IC50
  Tab Delimited (TSV)   2D SDfile   Computed 3D by Vconf -m prep SDfile
Find this compound or compounds like it in BindingDB:
Activity Spreadsheet -- Enzyme Inhibition Constant Data from BindingDB
Found 1 hit for monomerid = 50405638
TargetRenin(Homo sapiens (Human))
Abbott Laboratories
Curated by ChEMBL
LigandPNGBDBM50405638(CHEMBL2114113 | CHEMBL3348524)
Affinity DataIC50:  70nM. Assay description: In vitro inhibitory activity was tested against purified human renal renin
In DepthDetails ArticlePubMed