BDBM50405733 CHEMBL406575
SMILES Nc1nc2ccc(CN(CC#C)c3ccc(cc3)C(=O)NC(CCC(=O)NC(CCC(=O)NC(CCC(=O)NC(CCC(=O)NC(CCC(O)=O)C(O)=O)C(O)=O)C(O)=O)C(O)=O)C(O)=O)cc2c(=O)[nH]1
InChI Key InChIKey=JHSDRNYPBAGTMU-UHFFFAOYSA-N
Data  1 KI
  Tab Delimited (TSV)   2D SDfile   Computed 3D by Vconf -m prep SDfile
Find this compound or compounds like it in BindingDB:
Activity Spreadsheet -- Enzyme Inhibition Constant Data from BindingDB
Found 1 hit for monomerid = 50405733
TargetThymidylate synthase(Homo sapiens (Human))
Pedagogical University
Curated by ChEMBL
LigandPNGBDBM50405733(CHEMBL406575)
Affinity DataKi:  0.0420nM. Assay description: Compound was tested for inhibition of human (WI-L2) thymidylate synthase
In DepthDetails ArticlePubMed