BDBM504058 US11034692, Compound 326
SMILES C[C@@H]1[C@H]([C@@H]1c1cnn(C)c1)C(=O)Nc1cc2cc(nc(N)c2cn1)-c1cnccc1C
InChI Key InChIKey=GBCOVWIAYSDHDR-SKOKVVANSA-N
Data  1 KI
  Tab Delimited (TSV)   2D SDfile   Computed 3D by Vconf -m prep SDfile
Find this compound or compounds like it in BindingDB:
Activity Spreadsheet -- Enzyme Inhibition Constant Data from BindingDB
Found 1 hit for monomerid = 504058
TargetMitogen-activated protein kinase kinase kinase kinase 1(Homo sapiens (Human))
Genentech
US Patent
LigandPNGBDBM504058(US11034692, Compound 326)
Affinity DataKi:  0.0740nM. Assay description: Lanth: For the binding assay, 4 ul 2×HPK1 and Eu-anti-GST antibody were added to each well of the assay plate using a Multidrop reagent dispenser. Th...
Ligand InfoPC cidPC sid
In DepthDetails US Patent