BDBM50405956 CHEMBL57383
SMILES COc1cc(Cc2cnc(N)nc2N)ccc1OS(C)(=O)=O
InChI Key InChIKey=AAMMQVFLCXMBIO-UHFFFAOYSA-N
Data  3 KI
  Tab Delimited (TSV)   2D SDfile   Computed 3D by Vconf -m prep SDfile
Find this compound or compounds like it in BindingDB:
Activity Spreadsheet -- Enzyme Inhibition Constant Data from BindingDB
Found 3 hits for monomerid = 50405956
TargetDihydrofolate reductase type 1(Escherichia coli)
Pomona College
Curated by ChEMBL
LigandPNGBDBM50405956(CHEMBL57383)
Affinity DataKi:  11nM. Assay description: Inhibitory activity against Escherichia coli dihydrofolate reductase
In DepthDetails ArticlePubMed
TargetDihydrofolate reductase(Lactobacillus casei)
Pomona College
Curated by ChEMBL
LigandPNGBDBM50405956(CHEMBL57383)
Affinity DataKi:  363nM. Assay description: Inhibitory activity against Lactobacillus casei dihydrofolate reductase
In DepthDetails ArticlePubMed
TargetDihydrofolate reductase(Gallus gallus (Chicken))
Pomona College
Curated by ChEMBL
LigandPNGBDBM50405956(CHEMBL57383)
Affinity DataKi:  2.57E+4nM. Assay description: Inhibitory activity against chicken liver dihydrofolate reductase
In DepthDetails ArticlePubMed