BDBM50405961 CHEMBL57787
SMILES COc1cc(Cc2cnc(N)nc2N)cc(OC)c1C(C)=C
InChI Key InChIKey=KRRCOZZNVSJYJA-UHFFFAOYSA-N
Data  3 KI
  Tab Delimited (TSV)   2D SDfile   Computed 3D by Vconf -m prep SDfile
Find this compound or compounds like it in BindingDB:
Activity Spreadsheet -- Enzyme Inhibition Constant Data from BindingDB
Found 3 hits for monomerid = 50405961
TargetDihydrofolate reductase(Salmonella enterica subsp. enterica serovar Typhi)
Pomona College
Curated by ChEMBL
LigandPNGBDBM50405961(CHEMBL57787)
Affinity DataKi:  7.60nM. Assay description: Inhibitory activity against Escherichia coli dihydrofolate reductase
In DepthDetails ArticlePubMed
TargetDihydrofolate reductase(Lactobacillus casei)
Pomona College
Curated by ChEMBL
LigandPNGBDBM50405961(CHEMBL57787)
Affinity DataKi:  46nM. Assay description: Inhibitory activity against Lactobacillus casei dihydrofolate reductase
In DepthDetails ArticlePubMed
TargetDihydrofolate reductase(Gallus gallus (Chicken))
Pomona College
Curated by ChEMBL
LigandPNGBDBM50405961(CHEMBL57787)
Affinity DataKi:  6.76E+4nM. Assay description: Inhibitory activity against chicken liver dihydrofolate reductase
In DepthDetails ArticlePubMed