BDBM50405967 CHEMBL56757
SMILES COCCOc1ccc(Cc2cnc(N)nc2N)cc1OC
InChI Key InChIKey=QZGTXNUNYCKMJC-UHFFFAOYSA-N
Data  4 KI
  Tab Delimited (TSV)   2D SDfile   Computed 3D by Vconf -m prep SDfile
Find this compound or compounds like it in BindingDB:
Activity Spreadsheet -- Enzyme Inhibition Constant Data from BindingDB
Found 4 hits for monomerid = 50405967
TargetDihydrofolate reductase(Escherichia coli)
Beijing Medical University
Curated by ChEMBL
LigandPNGBDBM50405967(CHEMBL56757)
Affinity DataKi:  0.562nM. Assay description: Apparent inhibitory (log 1/Ki) activity against Escherichia coli dihydrofolate reductase
In DepthDetails ArticlePubMed
TargetDihydrofolate reductase(Salmonella enterica subsp. enterica serovar Typhi)
Pomona College
Curated by ChEMBL
LigandPNGBDBM50405967(CHEMBL56757)
Affinity DataKi:  17nM. Assay description: Inhibitory activity against Escherichia coli dihydrofolate reductase
In DepthDetails ArticlePubMed
TargetDihydrofolate reductase(Lactobacillus casei)
Pomona College
Curated by ChEMBL
LigandPNGBDBM50405967(CHEMBL56757)
Affinity DataKi:  288nM. Assay description: Inhibitory activity against Lactobacillus casei dihydrofolate reductase
In DepthDetails ArticlePubMed
TargetDihydrofolate reductase(Gallus gallus (Chicken))
Pomona College
Curated by ChEMBL
LigandPNGBDBM50405967(CHEMBL56757)
Affinity DataKi:  6.46E+4nM. Assay description: Inhibitory activity against chicken liver dihydrofolate reductase
In DepthDetails ArticlePubMed