BDBM50406420 CHEMBL2115367
SMILES CC(C)CC(NC(=O)CC(N)[C@H](CC1CCCCC1)NC(=O)[C@@H](Cc1cccnc1)c1nnc2c(CC(C)C)nc(cn12)-c1ccccc1)C(=O)NCc1ccccn1
InChI Key InChIKey=ATLHHAOOYRUXSA-SSYFDZPSSA-N
Data  2 IC50
  Tab Delimited (TSV)   2D SDfile   Computed 3D by Vconf -m prep SDfile
Find this compound or compounds like it in BindingDB:
Activity Spreadsheet -- Enzyme Inhibition Constant Data from BindingDB
Found 2 hits for monomerid = 50406420
TargetRenin(Homo sapiens (Human))
Ici Pharmaceuticals Group
Curated by ChEMBL
LigandPNGBDBM50406420(CHEMBL2115367)
Affinity DataIC50:  3.90nM. Assay description: Inhibition of human renin
In DepthDetails ArticlePubMed
TargetRenin(Homo sapiens (Human))
Ici Pharmaceuticals Group
Curated by ChEMBL
LigandPNGBDBM50406420(CHEMBL2115367)
Affinity DataIC50:  3.90nM. Assay description: Inhibition of human renin
In DepthDetails ArticlePubMed