BDBM50406468 CHEMBL4169564
SMILES CCCCCCC(=O)N[C@@H]1CNC(=O)[C@@H](CC(C)C)NC(=O)[C@@H](C)NC(=O)[C@@H](CCC(C)C)NC(=O)[C@@H](Cc2ccccc2)NC1=O
InChI Key InChIKey=VMGSYFSQLSPXQM-UHFFFAOYSA-N
Data  1 IC50
  Tab Delimited (TSV)   2D SDfile   Computed 3D by Vconf -m prep SDfile
Find this compound or compounds like it in BindingDB:
Activity Spreadsheet -- Enzyme Inhibition Constant Data from BindingDB
Found 1 hit for monomerid = 50406468
TargetSensory histidine kinase DcuS(Staphylococcus aureus)
University Of Copenhagen
Curated by ChEMBL
LigandPNGBDBM50406468(CHEMBL4169564)
Affinity DataIC50:  608nM. Assay description: Inhibition of AIP-stimulated quorum sensing system AgrC activation in Staphylococcus aureus RN10829 harboring P3:blaZ fusion assessed as reduction in...
In DepthDetails ArticlePubMed