BDBM50406474 CHEMBL2028945
SMILES CC[C@H](C)[C@H](NC(=O)[C@@H](CC(O)[C@H](CC(C)C)NC(=O)[C@H](Cc1cnc[nH]1)N(C)C(=O)[C@H](Cc1ccccc1)NC(=O)[C@@H]1CCCN1C(=O)CCCCCCC(=O)N(C)CCS([O-])(=O)=O)C(C)C)C(=O)NCc1cccc[n+]1[O-]
InChI Key InChIKey=YAHBTIXSJMYHMF-MRQREOCBSA-M
Data  1 IC50
  Tab Delimited (TSV)   2D SDfile   Computed 3D by Vconf -m prep SDfile
Find this compound or compounds like it in BindingDB:
Activity Spreadsheet -- Enzyme Inhibition Constant Data from BindingDB
Found 1 hit for monomerid = 50406474
TargetRenin(Homo sapiens (Human))
Upjohn
Curated by ChEMBL
LigandPNGBDBM50406474(CHEMBL2028945)
Affinity DataIC50:  0.310nM. Assay description: Inhibition of human plasma renin.
In DepthDetails ArticlePubMed