BDBM50406479 CHEMBL274403
SMILES O=c1[nH]n(-c2ccccc2)c2ccccc12
InChI Key InChIKey=MTYIBGCJCVRBMH-UHFFFAOYSA-N
Data  1 IC50
  Tab Delimited (TSV)   2D SDfile   Computed 3D by Vconf -m prep SDfile
Find this compound or compounds like it in BindingDB:
Activity Spreadsheet -- Enzyme Inhibition Constant Data from BindingDB
Found 1 hit for monomerid = 50406479
TargetPolyunsaturated fatty acid 5-lipoxygenase(Rattus norvegicus)
Ici Pharmaceuticals Group
Curated by ChEMBL
LigandPNGBDBM50406479(CHEMBL274403)
Affinity DataIC50:  3.00E+4nM. Assay description: In vitro inhibition of LTB4 production was measured in rat blood
In DepthDetails ArticlePubMed