BDBM50406675 CHEMBL2114201
SMILES CC(C)(C)OC(=O)N[C@@H](Cc1ccccc1)[C@@H](O)CN[C@@H](Cc1ccccc1)C(=O)N[C@@H]1[C@H](O)Cc2ccccc12
InChI Key InChIKey=QHSSQFJZPOJIOL-KTBGKDHWSA-N
Data  1 IC50
  Tab Delimited (TSV)   2D SDfile   Computed 3D by Vconf -m prep SDfile
Find this compound or compounds like it in BindingDB:
Activity Spreadsheet -- Enzyme Inhibition Constant Data from BindingDB
Found 1 hit for monomerid = 50406675
TargetGag-Pol polyprotein [489-587](Human immunodeficiency virus type 1)
Merck Research Laboratories
Curated by ChEMBL
LigandPNGBDBM50406675(CHEMBL2114201)
Affinity DataIC50:  4.70E+3nM. Assay description: Compound was evaluated in vitro for the inhibition of HIV protease, using a peptide hydrolysis assay
In DepthDetails ArticlePubMed