BDBM50406719 CHEMBL436448
SMILES Cc1cc(Cl)c2cc(CN(CC#C)c3ccc(C(=O)N[C@@H](CCC(=O)N[C@@H](CCC(=O)N[C@@H](CCC(O)=O)C(O)=O)C(O)=O)C(O)=O)c(F)c3)ccc2n1
InChI Key InChIKey=RPGWNNJVRKDOCF-AWCRTANDSA-N
Data  1 KI
  Tab Delimited (TSV)   2D SDfile   Computed 3D by Vconf -m prep SDfile
Find this compound or compounds like it in BindingDB:
Activity Spreadsheet -- Enzyme Inhibition Constant Data from BindingDB
Found 1 hit for monomerid = 50406719
TargetThymidylate synthase(Mus musculus)
Institute Of Cancer Research
Curated by ChEMBL
LigandPNGBDBM50406719(CHEMBL436448)
Affinity DataKi:  1nM. Assay description: Inhibition of thymidylate synthase, partially purified from L1210 mouse leukemia cells overexpressing TS
In DepthDetails ArticlePubMed