BDBM50406760 CHEMBL38671
SMILES CN(C)CCc1c[nH]c2ccc(Cc3nc(no3)-c3ccc(NS(C)(=O)=O)cc3)cc12
InChI Key InChIKey=YIRZCLCPNKBHHA-UHFFFAOYSA-N
Data  1 IC50
  Tab Delimited (TSV)   2D SDfile   Computed 3D by Vconf -m prep SDfile
Find this compound or compounds like it in BindingDB:
Activity Spreadsheet -- Enzyme Inhibition Constant Data from BindingDB
Found 1 hit for monomerid = 50406760
Target5-hydroxytryptamine receptor 1D(Sus scrofa)
Merck Sharp And Dohme Research Laboratories
Curated by ChEMBL
LigandPNGBDBM50406760(CHEMBL38671)
Affinity DataIC50:  10nM. Assay description: Displacement of radioligand [3H]5-HT binding to 5-hydroxytryptamine 1D receptor in pig caudate membrane
In DepthDetails ArticlePubMed