BDBM50407034 CHEMBL132945
SMILES CC(C)(C)NC(=O)[C@@H]1C[C@@H]2CCCC[C@@H]2CN1C(=O)[C@@H](O)[C@H](Cc1ccccc1)NC(=O)[C@H](CC(N)=O)NC(=O)OCc1ccccc1
InChI Key InChIKey=CGAYPCFRXYLKOE-SXINAPMGSA-N
Data  2 IC50
  Tab Delimited (TSV)   2D SDfile   Computed 3D by Vconf -m prep SDfile
Find this compound or compounds like it in BindingDB:
Activity Spreadsheet -- Enzyme Inhibition Constant Data from BindingDB
Found 2 hits for monomerid = 50407034
TargetGag-Pol polyprotein [489-587](Human immunodeficiency virus type 1)
Washington University
Curated by ChEMBL
LigandPNGBDBM50407034(CHEMBL132945)
Affinity DataIC50:  84.0nM. Assay description: Inhibitory potency against HIV-1 protease
In DepthDetails ArticlePubMed
TargetGag-Pol polyprotein [489-587](Human immunodeficiency virus type 1)
Washington University
Curated by ChEMBL
LigandPNGBDBM50407034(CHEMBL132945)
Affinity DataIC50:  84nM. Assay description: Inhibitory activity of the Compound was tested against HIV protease enzyme.
In DepthDetails ArticlePubMed