BDBM50408042 CHEMBL555594
SMILES OCCCc1cnc[nH]1
InChI Key InChIKey=DKFVEDKCRIZEEM-UHFFFAOYSA-N
Data  2 KI
  Tab Delimited (TSV)   2D SDfile   Computed 3D by Vconf -m prep SDfile
Find this compound or compounds like it in BindingDB:
Activity Spreadsheet -- Enzyme Inhibition Constant Data from BindingDB
Found 2 hits for monomerid = 50408042
TargetHistamine H3 receptor(Rattus norvegicus (rat))
Freie UniversitäT Berlin
Curated by ChEMBL
LigandPNGBDBM50408042(CHEMBL555594)
Affinity DataKi:  398nM. Assay description: In vitro antagonistic activity tested against Histamine H3 receptor on synaptosomes from rat cerebral cortex
In DepthDetails ArticlePubMed
TargetHistamine H3 receptor(Rattus norvegicus (rat))
Freie UniversitäT Berlin
Curated by ChEMBL
LigandPNGBDBM50408042(CHEMBL555594)
Affinity DataKi:  631nM. Assay description: Binding affinity towards Histamine H3 receptor on synaptosomes from rat cerebral cortex
In DepthDetails ArticlePubMed