BDBM50408266 CHEMBL2112533
SMILES Cc1ncc([nH]1)[C@H]1CC[C@H]2[C@@H]3CC=C4C[C@@H](O)CC[C@]4(C)[C@H]3CC[C@]12C
InChI Key InChIKey=YYVJPYSXCHDNEY-MTMZYOSNSA-N
Data  2 IC50
  Tab Delimited (TSV)   2D SDfile   Computed 3D by Vconf -m prep SDfile
Find this compound or compounds like it in BindingDB:
Activity Spreadsheet -- Enzyme Inhibition Constant Data from BindingDB
Found 2 hits for monomerid = 50408266
TargetSteroid 17-alpha-hydroxylase/17,20 lyase(Rattus norvegicus (Rat))
University Of Maryland
Curated by ChEMBL
LigandPNGBDBM50408266(CHEMBL2112533)
Affinity DataIC50:  4.81E+3nM. Assay description: Inhibition of rat testicular microsomal Cytochrome P450 17A1
In DepthDetails ArticlePubMed
TargetSteroid 17-alpha-hydroxylase/17,20 lyase(Homo sapiens (Human))
University Of Maryland
Curated by ChEMBL
LigandPNGBDBM50408266(CHEMBL2112533)
Affinity DataIC50:  400nM. Assay description: Inhibition of human testicular microsomal Cytochrome P450 17A1
In DepthDetails ArticlePubMed