BDBM50408270 CHEMBL2112528
SMILES CC(=O)O[C@H]1CC[C@]2(C)[C@H]3CC[C@@]4(C)[C@@H](CC[C@@H]4c4cnc[nH]4)[C@@H]3CC=C2C1
InChI Key InChIKey=QZITXHJSJFHYIX-OHOJESAGSA-N
Data  2 IC50
  Tab Delimited (TSV)   2D SDfile   Computed 3D by Vconf -m prep SDfile
Find this compound or compounds like it in BindingDB:
Activity Spreadsheet -- Enzyme Inhibition Constant Data from BindingDB
Found 2 hits for monomerid = 50408270
TargetSteroid 17-alpha-hydroxylase/17,20 lyase(Rattus norvegicus (Rat))
University Of Maryland
Curated by ChEMBL
LigandPNGBDBM50408270(CHEMBL2112528)
Affinity DataIC50:  1.50E+3nM. Assay description: Inhibition of rat testicual micrososmal Cytochrome P450 17A1
In DepthDetails ArticlePubMed
TargetSteroid 17-alpha-hydroxylase/17,20 lyase(Homo sapiens (Human))
University Of Maryland
Curated by ChEMBL
LigandPNGBDBM50408270(CHEMBL2112528)
Affinity DataIC50:  199nM. Assay description: Inhibition of human testicular microsomal Cytochrome P450 17A1
In DepthDetails ArticlePubMed