BDBM50408352 CHEMBL137418
SMILES Clc1cc(Cl)c2c(c1)oc1c(Cl)cc(Cl)c(Cl)c21
InChI Key InChIKey=IYGVHNHWORPMFU-UHFFFAOYSA-N
Data  1 EC50
  Tab Delimited (TSV)   2D SDfile   Computed 3D by Vconf -m prep SDfile
Find this compound or compounds like it in BindingDB:
Activity Spreadsheet -- Enzyme Inhibition Constant Data from BindingDB
Found 1 hit for monomerid = 50408352
TargetAryl hydrocarbon receptor(Homo sapiens (Human))
Harvard University
Curated by ChEMBL
LigandPNGBDBM50408352(CHEMBL137418)
Affinity DataEC50:  2.00E+4nM. Assay description: Affinity on cytosolic Aromatic hydrocarbon receptor (Ah)
In DepthDetails ArticlePubMed