BDBM50408377 CHEMBL139204
SMILES Clc1cc2c(oc3ccccc23)c(Cl)c1Cl
InChI Key InChIKey=YDLADWPBKZODCJ-UHFFFAOYSA-N
Data  1 EC50
  Tab Delimited (TSV)   2D SDfile   Computed 3D by Vconf -m prep SDfile
Find this compound or compounds like it in BindingDB:
Activity Spreadsheet -- Enzyme Inhibition Constant Data from BindingDB
Found 1 hit for monomerid = 50408377
TargetAryl hydrocarbon receptor(Homo sapiens (Human))
Harvard University
Curated by ChEMBL
LigandPNGBDBM50408377(CHEMBL139204)
Affinity DataEC50:  1.90E+4nM. Assay description: Affinity on cytosolic Aromatic hydrocarbon receptor (Ah)
In DepthDetails ArticlePubMed