BDBM50408515 CHEMBL338770
SMILES CC(C)C[C@H](NC(=O)OCc1ccccc1)C(=O)NNC(=O)NNC(=O)c1ccccc1OCc1ccccc1
InChI Key InChIKey=NBMGTWJKFOTJOM-DEOSSOPVSA-N
Data  1 KI
  Tab Delimited (TSV)   2D SDfile   Computed 3D by Vconf -m prep SDfile
Find this compound or compounds like it in BindingDB:
Activity Spreadsheet -- Enzyme Inhibition Constant Data from BindingDB
Found 1 hit for monomerid = 50408515
TargetCathepsin K(Homo sapiens (Human))
Smithkline Beecham Pharmaceuticals
Curated by ChEMBL
LigandPNGBDBM50408515(CHEMBL338770)
Affinity DataKi:  12nM. Assay description: Relative binding affinity was measured for Cathepsin K
In DepthDetails ArticlePubMed