BDBM50408572 CHEMBL35017
SMILES CCCCCC(=O)NCCc1cccc2ccc(OC)cc12
InChI Key InChIKey=XGXFTHBMSWQXBD-UHFFFAOYSA-N
Data  1 IC50  1 Kd
  Tab Delimited (TSV)   2D SDfile   Computed 3D by Vconf -m prep SDfile
Find this compound or compounds like it in BindingDB:
Activity Spreadsheet -- Enzyme Inhibition Constant Data from BindingDB
Found 2 hits for monomerid = 50408572
TargetMelatonin receptor type 1A/1B(Homo sapiens (Human))
Institut De Chimie Pharmaceutique
Curated by ChEMBL
LigandPNGBDBM50408572(CHEMBL35017)
Affinity DataKd:  280nM. Assay description: Binding affinity to melatonin receptor measured on ovine pars tuberalis membrane
In DepthDetails ArticlePubMed
TargetMelatonin receptor type 1A(Homo sapiens (Human))
Universit£
Curated by ChEMBL
LigandPNGBDBM50408572(CHEMBL35017)
Affinity DataIC50:  2.00E+3nM. Assay description: Melatonin receptor type 1A binding affinity measured using 2-[125I]iodomelatonin on ovine pars tuberalis membrane homogenates.
In DepthDetails ArticlePubMed