BDBM50408858 CHEMBL2113680
SMILES CCOC(=O)COc1c(nc2ccccc2c1C(=O)N[C@@H](CC)c1ccccc1)-c1ccccc1
InChI Key InChIKey=RCLLEVTVIPLVMM-QHCPKHFHSA-N
Data  1 KI
  Tab Delimited (TSV)   2D SDfile   Computed 3D by Vconf -m prep SDfile
Find this compound or compounds like it in BindingDB:
Activity Spreadsheet -- Enzyme Inhibition Constant Data from BindingDB
Found 1 hit for monomerid = 50408858
TargetNeuromedin-K receptor(Homo sapiens (Human))
Smithkline Beecham
Curated by ChEMBL
LigandPNGBDBM50408858(CHEMBL2113680)
Affinity DataKi:  2nM. Assay description: Binding affinity towards cloned human Tachykinin receptor 3 (hNK-3) expressed in CHO cells using [125I][MePhe7]-NKB
In DepthDetails ArticlePubMed