BDBM50408872 CHEMBL58548
SMILES C[C@@H](NC(=O)CC[C@H](NC(=O)c1ccc(cc1)N(CC#C)C1CCc2cc3nc(C)[nH]c(=O)c3cc12)C(O)=O)C(O)=O
InChI Key InChIKey=XKEXFUAHKWUPLX-BDPWFDOZSA-N
Data  1 KI
  Tab Delimited (TSV)   2D SDfile   Computed 3D by Vconf -m prep SDfile
Find this compound or compounds like it in BindingDB:
Activity Spreadsheet -- Enzyme Inhibition Constant Data from BindingDB
Found 1 hit for monomerid = 50408872
TargetThymidylate synthase(Mus musculus)
The Institute Of Cancer Research
Curated by ChEMBL
LigandPNGBDBM50408872(CHEMBL58548)
Affinity DataKi:  1.10nM. Assay description: Binding affinity against thymidylate synthase from L1210 mouse leukemia cells
In DepthDetails ArticlePubMed