BDBM50408912 CHEMBL303002
SMILES C[N+](C)(CCCCCC[N+](C)(C)CCCN1Cc2ccccc2C1=O)CCCN1Cc2ccccc2C1=O
InChI Key InChIKey=JXTFRADQSSIBFG-UHFFFAOYSA-N
Data  2 EC50
  Tab Delimited (TSV)   2D SDfile   Computed 3D by Vconf -m prep SDfile
Find this compound or compounds like it in BindingDB:
Activity Spreadsheet -- Enzyme Inhibition Constant Data from BindingDB
Found 2 hits for monomerid = 50408912
TargetMuscarinic acetylcholine receptor M2(GUINEA PIG)
University Of Wuerzburg
Curated by ChEMBL
LigandPNGBDBM50408912(CHEMBL303002)
Affinity DataEC50:  2.00E+3nM. Assay description: Ability to dissociate radioligand [3H]NMS from muscarinic acetylcholine receptor M2 of porcine heart
In DepthDetails ArticlePubMed
TargetMuscarinic acetylcholine receptor M2(GUINEA PIG)
University Of Wuerzburg
Curated by ChEMBL
LigandPNGBDBM50408912(CHEMBL303002)
Affinity DataEC50:  2.00E+3nM. Assay description: Inhibition of [3H]- N-methyl-scopolamine ([3H]NMS) dissociation from porcine cardiac M2-receptors
In DepthDetails ArticlePubMed