BDBM50408998 CHEMBL1233940::L-756423
SMILES CC(C)(C)NC(=O)[C@@H]1CN(Cc2cc3ccccc3o2)CCN1C[C@@H](O)C[C@@H](Cc1ccccc1)C(=O)N[C@@H]1[C@H](O)Cc2ccccc12
InChI Key InChIKey=AOMZDQMIOCTPQP-QHQMVRJISA-N
Data  1 IC50
PDB links: 1 PDB ID matches this monomer.
  Tab Delimited (TSV)   2D SDfile   Computed 3D by Vconf -m prep SDfile
Find this compound or compounds like it in BindingDB:
Activity Spreadsheet -- Enzyme Inhibition Constant Data from BindingDB
Found 1 hit for monomerid = 50408998
TargetGag-Pol polyprotein [489-587](Human immunodeficiency virus type 1)
Merck Research Laboratories
Curated by ChEMBL
LigandPNGBDBM50408998(CHEMBL1233940 | L-756423)
Affinity DataIC50:  0.180nM. Assay description: Inhibition of HIV-1 protease in vitro.