BDBM50409302 CHEMBL2113434
SMILES CONC(=O)[C@H]1O[C@H]([C@H](O)[C@@H]1O)n1cnc2c(N)ncnc12
InChI Key InChIKey=FCAHXBLMILKKQK-QMWPFBOUSA-N
Data  1 KI
  Tab Delimited (TSV)   2D SDfile   Computed 3D by Vconf -m prep SDfile
Find this compound or compounds like it in BindingDB:
Activity Spreadsheet -- Enzyme Inhibition Constant Data from BindingDB
Found 1 hit for monomerid = 50409302
Target2-oxoglutarate receptor 1(Rattus norvegicus)
Hokkaido University
Curated by ChEMBL
LigandPNGBDBM50409302(CHEMBL2113434)
Affinity DataKi:  58nM. Assay description: Binding activity of P3 purinoceptor-like protein (P3LP) using radioligand 40 nM [3H]NECA from rat brain membranes
In DepthDetails ArticlePubMed