BDBM50409509 CHEMBL87943
SMILES Fc1ccc(cc1)C(=O)C1CCN(CCC2CCc3ccccc3C2=O)CC1
InChI Key InChIKey=CWYWUEUVHLRQJP-UHFFFAOYSA-N
Data  7 KI
  Tab Delimited (TSV)   2D SDfile   Computed 3D by Vconf -m prep SDfile
Find this compound or compounds like it in BindingDB:
Activity Spreadsheet -- Enzyme Inhibition Constant Data from BindingDB
Found 7 hits for monomerid = 50409509
Target5-hydroxytryptamine receptor 2A(Rattus norvegicus (rat))
Universidad De Santiago
Curated by ChEMBL
LigandPNGBDBM50409509(CHEMBL87943)
Affinity DataKi:  7.80nM. Assay description: In vitro ability to displace [3H]ketanserin binding from 5-hydroxytryptamine 2A receptor in rat striatal membrane.
In DepthDetails ArticlePubMed
Target5-hydroxytryptamine receptor 2A(Rattus norvegicus (rat))
Universidad De Santiago
Curated by ChEMBL
LigandPNGBDBM50409509(CHEMBL87943)
Affinity DataKi:  7.80nM. Assay description: Kinetic inhibition constant evaluated by measuring serotonergic activity
In DepthDetails ArticlePubMed
Target5-hydroxytryptamine receptor 2A(Rattus norvegicus (rat))
Universidad De Santiago
Curated by ChEMBL
LigandPNGBDBM50409509(CHEMBL87943)
Affinity DataKi:  7.80nM. Assay description: Inhibition of [3H]ketanserin binding to 5-hydroxytryptamine 2A receptor rat frontal cortex membrane
In DepthDetails ArticlePubMed
TargetD(2) dopamine receptor(Rattus norvegicus (rat))
University Of Santiago De Compostela
Curated by ChEMBL
LigandPNGBDBM50409509(CHEMBL87943)
Affinity DataKi:  48nM. Assay description: Inhibition of [3H]-spiperone 23390 binding to dopamine receptor D2 rat striatal membrane
In DepthDetails ArticlePubMed
TargetD(2) dopamine receptor(Rattus norvegicus (rat))
University Of Santiago De Compostela
Curated by ChEMBL
LigandPNGBDBM50409509(CHEMBL87943)
Affinity DataKi:  48nM. Assay description: In vitro ability to displace [3H]spiperone binding from dopamine receptor D2 in rat striatal membrane.
In DepthDetails ArticlePubMed
TargetD(1A) dopamine receptor(RAT)
Universidad De Santiago
Curated by ChEMBL
LigandPNGBDBM50409509(CHEMBL87943)
Affinity DataKi:  1.55E+3nM. Assay description: In vitro ability to displace [3H]SCH-23390 binding from Dopamine receptor D1 in rat striatal membrane.
In DepthDetails ArticlePubMed
TargetD(1A) dopamine receptor(RAT)
Universidad De Santiago
Curated by ChEMBL
LigandPNGBDBM50409509(CHEMBL87943)
Affinity DataKi:  1.55E+3nM. Assay description: Inhibition of [3H]-SCH- 23390 binding to dopamine receptor D1 rat striatal membrane
In DepthDetails ArticlePubMed