BDBM50409517 CHEMBL320572
SMILES Fc1ccc2c(noc2c1)C1CCN(CC2Cc3sccc3C(=O)C2)CC1
InChI Key InChIKey=UUWNMTNBWJAYKN-UHFFFAOYSA-N
Data  5 KI
  Tab Delimited (TSV)   2D SDfile   Computed 3D by Vconf -m prep SDfile
Find this compound or compounds like it in BindingDB:
Activity Spreadsheet -- Enzyme Inhibition Constant Data from BindingDB
Found 5 hits for monomerid = 50409517
Target5-hydroxytryptamine receptor 2A(Rattus norvegicus (rat))
Universidad De Santiago
Curated by ChEMBL
LigandPNGBDBM50409517(CHEMBL320572)
Affinity DataKi:  4.70nM. Assay description: In vitro ability to displace [3H]ketanserin binding from 5-hydroxytryptamine 2A receptor in rat striatal membrane.
In DepthDetails ArticlePubMed
Target5-hydroxytryptamine receptor 2A(Rattus norvegicus (rat))
Universidad De Santiago
Curated by ChEMBL
LigandPNGBDBM50409517(CHEMBL320572)
Affinity DataKi:  4.70nM. Assay description: Kinetic inhibition constant evaluated by measuring serotonergic activity
In DepthDetails ArticlePubMed
TargetD(2) dopamine receptor(Rattus norvegicus (rat))
Universidad De Santiago
Curated by ChEMBL
LigandPNGBDBM50409517(CHEMBL320572)
Affinity DataKi:  55nM. Assay description: In vitro ability to displace [3H]spiperone binding from dopamine receptor D2 in rat striatal membrane.
In DepthDetails ArticlePubMed
TargetD(1A) dopamine receptor(RAT)
Universidad De Santiago
Curated by ChEMBL
LigandPNGBDBM50409517(CHEMBL320572)
Affinity DataKi:  129nM. Assay description: In vitro ability to displace [3H]SCH-23390 binding from Dopamine 1 (D1) receptor in rat striatal membrane.
In DepthDetails ArticlePubMed
Target5-hydroxytryptamine receptor 2C(Homo sapiens (Human))
Universidad De Santiago
Curated by ChEMBL
LigandPNGBDBM50409517(CHEMBL320572)
Affinity DataKi:  204nM. Assay description: In vitro ability to displace [3H]mesulergine binding from 5-hydroxytryptamine 2C receptor from bovine choroid plexus.
In DepthDetails ArticlePubMed