BDBM50410661 CHEMBL381214
SMILES Cn1c2cc([nH]c2c(=O)n(C)c1=O)-c1ccc(OCC(=O)Nc2ccc(cc2)[N+]([O-])=O)cc1
InChI Key InChIKey=VCPSPVGCIBZGCA-UHFFFAOYSA-N
Data  2 KI
  Tab Delimited (TSV)   2D SDfile   Computed 3D by Vconf -m prep SDfile
Find this compound or compounds like it in BindingDB:
Activity Spreadsheet -- Enzyme Inhibition Constant Data from BindingDB
Found 2 hits for monomerid = 50410661
TargetAdenosine receptor A2b(Homo sapiens (Human))
Universit£
Curated by ChEMBL
LigandPNGBDBM50410661(CHEMBL381214)
Affinity DataKi:  6.92nM. Assay description: Binding affinity to recombinant human adenosine A2B receptor
In DepthDetails ArticlePubMed
TargetAdenosine receptor A2a(Homo sapiens (Human))
Universit£
Curated by ChEMBL
LigandPNGBDBM50410661(CHEMBL381214)
Affinity DataKi:  81.3nM. Assay description: Binding affinity to recombinant human adenosine A2A receptor
In DepthDetails ArticlePubMed