BDBM50410686 CHEMBL203037
SMILES CCCn1c(=O)n(C)c2cc([nH]c2c1=O)-c1ccc(OCC(=O)Nc2ccc(OC)nc2)cc1
InChI Key InChIKey=ZJIWYSVNLCZXDJ-UHFFFAOYSA-N
Data  2 KI
  Tab Delimited (TSV)   2D SDfile   Computed 3D by Vconf -m prep SDfile
Find this compound or compounds like it in BindingDB:
Activity Spreadsheet -- Enzyme Inhibition Constant Data from BindingDB
Found 2 hits for monomerid = 50410686
TargetAdenosine receptor A2b(Homo sapiens (Human))
Universit£
Curated by ChEMBL
LigandPNGBDBM50410686(CHEMBL203037)
Affinity DataKi:  3.16nM. Assay description: Binding affinity to recombinant human adenosine A2B receptor
In DepthDetails ArticlePubMed
TargetAdenosine receptor A2a(Homo sapiens (Human))
Universit£
Curated by ChEMBL
LigandPNGBDBM50410686(CHEMBL203037)
Affinity DataKi:  132nM. Assay description: Binding affinity to recombinant human adenosine A2A receptor
In DepthDetails ArticlePubMed