BDBM50410774 CHEMBL381091
SMILES CCCn1c2cc([nH]c2c(=O)n(CCC)c1=O)-c1ccc(OC(CC)C(=O)Nc2ccc(F)cc2)cc1
InChI Key InChIKey=MLOKMUUSEUIIGH-UHFFFAOYSA-N
Data  2 KI
  Tab Delimited (TSV)   2D SDfile   Computed 3D by Vconf -m prep SDfile
Find this compound or compounds like it in BindingDB:
Activity Spreadsheet -- Enzyme Inhibition Constant Data from BindingDB
Found 2 hits for monomerid = 50410774
TargetAdenosine receptor A2b(Homo sapiens (Human))
Universit£
Curated by ChEMBL
LigandPNGBDBM50410774(CHEMBL381091)
Affinity DataKi:  4.79nM. Assay description: Binding affinity to recombinant human adenosine A2B receptor
In DepthDetails ArticlePubMed
TargetAdenosine receptor A2a(Homo sapiens (Human))
Universit£
Curated by ChEMBL
LigandPNGBDBM50410774(CHEMBL381091)
Affinity DataKi:  19.1nM. Assay description: Binding affinity to recombinant human adenosine A2A receptor
In DepthDetails ArticlePubMed