BDBM50410898 CHEMBL205757
SMILES CC(C)C[C@H](NC(=O)[C@H](C)NC(=O)[C@H](CC(=O)NCC(C)(C)C)NS(=O)(=O)c1ccc(C)cc1)C(=O)c1nnc(o1)-c1ccc(cc1)N(C)C
InChI Key InChIKey=QZFWUXSTOBKWML-RNCAPKPVSA-N
Data  3 KI
  Tab Delimited (TSV)   2D SDfile   Computed 3D by Vconf -m prep SDfile
Find this compound or compounds like it in BindingDB:
Activity Spreadsheet -- Enzyme Inhibition Constant Data from BindingDB
Found 3 hits for monomerid = 50410898
TargetProteasome subunit beta type-5(Homo sapiens (Human))
Celera
Curated by ChEMBL
LigandPNGBDBM50410898(CHEMBL205757)
Affinity DataKi:  0.510nM. Assay description: Inhibition of chymotrypsin-like proteasome activity of human 20S proteasome
In DepthDetails ArticlePubMed
TargetProteasome subunit beta type-2(Homo sapiens (Human))
Celera
Curated by ChEMBL
LigandPNGBDBM50410898(CHEMBL205757)
Affinity DataKi:  2.90E+5nM. Assay description: Inhibition of trypsin-like proteasome activity of human 20S proteasome
In DepthDetails ArticlePubMed
TargetProteasome subunit beta type-1(Homo sapiens (Human))
Celera
Curated by ChEMBL
LigandPNGBDBM50410898(CHEMBL205757)
Affinity DataKi: >3.00E+5nM. Assay description: Inhibition of post glutamyl peptide hydrolase-like proteasome activity of human 20S proteasome
In DepthDetails ArticlePubMed