BDBM50410963 CHEMBL210702
SMILES CCC[C@H](NC(=O)OCC(C)C)C(=O)c1nnc(o1)-c1ccco1
InChI Key InChIKey=QSFFAUMRNCREGS-NSHDSACASA-N
Data  4 KI
  Tab Delimited (TSV)   2D SDfile   Computed 3D by Vconf -m prep SDfile
Find this compound or compounds like it in BindingDB:
Activity Spreadsheet -- Enzyme Inhibition Constant Data from BindingDB
Found 4 hits for monomerid = 50410963
TargetCathepsin S(Homo sapiens (Human))
Celera Genomics
Curated by ChEMBL
LigandPNGBDBM50410963(CHEMBL210702)
Affinity DataKi:  380nM. Assay description: Inhibition of human cathepsin S
In DepthDetails ArticlePubMed
TargetCathepsin K(Homo sapiens (Human))
Celera Genomics
Curated by ChEMBL
LigandPNGBDBM50410963(CHEMBL210702)
Affinity DataKi:  500nM. Assay description: Inhibition of human cathepsin K
In DepthDetails ArticlePubMed
TargetProcathepsin L(Homo sapiens (Human))
Celera Genomics
Curated by ChEMBL
LigandPNGBDBM50410963(CHEMBL210702)
Affinity DataKi:  1.40E+4nM. Assay description: Inhibition of human cathepsin L
In DepthDetails ArticlePubMed
TargetCathepsin B(Homo sapiens (Human))
Celera Genomics
Curated by ChEMBL
LigandPNGBDBM50410963(CHEMBL210702)
Affinity DataKi:  1.60E+4nM. Assay description: Inhibition of human cathepsin B
In DepthDetails ArticlePubMed