BDBM50410996 CHEMBL537647
SMILES CCOC(=O)N[C@@H](CCCCN)C(=O)c1noc(Cc2ccc(OCCc3ccc(Cl)c(Cl)c3)cc2)n1
InChI Key InChIKey=JFCVNWMMGCAHDT-QFIPXVFZSA-N
Data  1 KI
  Tab Delimited (TSV)   2D SDfile   Computed 3D by Vconf -m prep SDfile
Find this compound or compounds like it in BindingDB:
Activity Spreadsheet -- Enzyme Inhibition Constant Data from BindingDB
Found 1 hit for monomerid = 50410996
TargetTryptase beta-2(Homo sapiens (Human))
Celera Genomics
Curated by ChEMBL
LigandPNGBDBM50410996(CHEMBL537647)
Affinity DataKi:  4.70nM. Assay description: Inhibition of human B tryptase
In DepthDetails ArticlePubMed