BDBM50411339 CHEMBL227276
SMILES O=C(CN1N=C(C2CCCCC2)c2ccccc2N(CC(=O)C2CCCC2)C1=O)Nc1cccc(c1)-c1nc(=O)o[nH]1
InChI Key InChIKey=DGKMBNVRIZTNTK-UHFFFAOYSA-N
Data  3 KI
  Tab Delimited (TSV)   2D SDfile   Computed 3D by Vconf -m prep SDfile
Find this compound or compounds like it in BindingDB:
Activity Spreadsheet -- Enzyme Inhibition Constant Data from BindingDB
Found 3 hits for monomerid = 50411339
TargetGastrin/cholecystokinin type B receptor(Homo sapiens (Human))
James Black Foundation
Curated by ChEMBL
LigandPNGBDBM50411339(CHEMBL227276)
Affinity DataKi:  0.110nM. Assay description: Displacement of [3H]BH-CCK-8S from human recombinant CCK2 receptor expressed in NIH3T3 cellsChecked by Author
In DepthDetails ArticlePubMed
TargetGastrin/cholecystokinin type B receptor(Dog)
James Black Foundation
Curated by ChEMBL
LigandPNGBDBM50411339(CHEMBL227276)
Affinity DataKi:  4.5nM. Assay description: Displacement of [125I]BH-CCK8-8S from CCK2 receptor in canine gastric mucosaChecked by Author
In DepthDetails ArticlePubMed
TargetCholecystokinin receptor type A(Homo sapiens (Human))
James Black Foundation
Curated by ChEMBL
LigandPNGBDBM50411339(CHEMBL227276)
Affinity DataKi:  468nM. Assay description: Displacement of [3H]L-364718 from human recombinant CCK1 receptor expressed in CHOK1 cellsChecked by Author
In DepthDetails ArticlePubMed