BDBM50411615 CHEMBL401086
SMILES CC[C@@H](C)[C@H](S)C(=O)NCC(O)=O
InChI Key InChIKey=OKMLPKRGXRLVMI-VDTYLAMSSA-N
Data  2 KI
  Tab Delimited (TSV)   2D SDfile   Computed 3D by Vconf -m prep SDfile
Find this compound or compounds like it in BindingDB:
Activity Spreadsheet -- Enzyme Inhibition Constant Data from BindingDB
Found 2 hits for monomerid = 50411615
TargetNeprilysin(Homo sapiens (Human))
Glaxosmithkline
Curated by ChEMBL
LigandPNGBDBM50411615(CHEMBL401086)
Affinity DataKi:  5.10E+3nM. Assay description: Inhibition of human recombinant NEP by fluorescence assay
In DepthDetails ArticlePubMed
TargetCarboxypeptidase A1(Homo sapiens (Human))
Glaxosmithkline
Curated by ChEMBL
LigandPNGBDBM50411615(CHEMBL401086)
Affinity DataKi:  3.50E+4nM. Assay description: Inhibition of human recombinant CpA by fluorescence assay
In DepthDetails ArticlePubMed