BDBM50411913 IROMYCIN C
SMILES CCCc1c(C\C=C(/C)C\C=C\CC)[nH]c(=O)c(C)c1O
InChI Key InChIKey=CYTLCZVDDYEJPL-IGOCJVNJSA-N
Data  1 IC50
  Tab Delimited (TSV)   2D SDfile   Computed 3D by Vconf -m prep SDfile
Find this compound or compounds like it in BindingDB:
Activity Spreadsheet -- Enzyme Inhibition Constant Data from BindingDB
Found 1 hit for monomerid = 50411913
TargetAcyl carrier protein, mitochondrial(Bos taurus)
Georg-August-Universit£T G£Ttingen
Curated by ChEMBL
LigandPNGBDBM50411913(IROMYCIN C)
Affinity DataIC50:  3.52E+3nM. Assay description: Inhibition of NADH-ubiquinone oxidoreductase assessed as NADH oxidase activity in bovine heart submitochondrial particles
In DepthDetails ArticlePubMed