BDBM50412209 CHEMBL494466
SMILES CC(C)COc1ccc(Cl)cc1Cn1nc(NC(=O)c2ccc(cc2)C2CCCN2)cc1C
InChI Key InChIKey=BLDYLZYPGHVSPG-UHFFFAOYSA-N
Data  1 KI  1 IC50
  Tab Delimited (TSV)   2D SDfile   Computed 3D by Vconf -m prep SDfile
Find this compound or compounds like it in BindingDB:
Activity Spreadsheet -- Enzyme Inhibition Constant Data from BindingDB
Found 2 hits for monomerid = 50412209
TargetProstaglandin E2 receptor EP1 subtype(Homo sapiens (Human))
Glaxosmithkline
Curated by ChEMBL
LigandPNGBDBM50412209(CHEMBL494466)
Affinity DataKi:  100nM. Assay description: Antagonist activity of human PGE2 receptor expressed in CHOK1 cells assessed as inhibition of intracellular calcium mobilisation by FLIPR assay
In DepthDetails ArticlePubMed
TargetProstaglandin E2 receptor EP1 subtype(Homo sapiens (Human))
Glaxosmithkline
Curated by ChEMBL
LigandPNGBDBM50412209(CHEMBL494466)
Affinity DataIC50:  100nM. Assay description: Displacement of [H3PGE2 from human EP1 receptor expressed in CHOK1 cells
In DepthDetails ArticlePubMed