BDBM50412369 CHEMBL518959
SMILES O[C@@H]1[C@@H](COS(=O)(=O)[N-]C(=O)c2ccccc2O)O[C@H]([C@@H]1O)n1cnc2c(NC3CCCC3)ncnc12
InChI Key InChIKey=ZAGPLQUPVANFGJ-UVLLPENVSA-M
Data  1 KI
  Tab Delimited (TSV)   2D SDfile   Computed 3D by Vconf -m prep SDfile
Find this compound or compounds like it in BindingDB:
Activity Spreadsheet -- Enzyme Inhibition Constant Data from BindingDB
Found 1 hit for monomerid = 50412369
TargetSalicyl-AMP ligase / salicyl-S-ArCP synthetase(Mycobacterium tuberculosis)
University Of Minnesota
Curated by ChEMBL
LigandPNGBDBM50412369(CHEMBL518959)
Affinity DataKi:  9.41E+3nM. Assay description: Inhibition of Mycobacterium tuberculosis recombinant MbtA expressed in Escherichia coli by ATP-PPi exchange assay
In DepthDetails ArticlePubMed