BDBM50412372 CHEMBL459678
SMILES CC(C)CNc1ncnc2n(cnc12)[C@@H]1O[C@H](COS(=O)(=O)[N-]C(=O)c2ccccc2O)[C@@H](O)[C@H]1O
InChI Key InChIKey=CIRUSYHNUVVFKN-VGKBRBPRSA-M
Data  1 KI
  Tab Delimited (TSV)   2D SDfile   Computed 3D by Vconf -m prep SDfile
Find this compound or compounds like it in BindingDB:
Activity Spreadsheet -- Enzyme Inhibition Constant Data from BindingDB
Found 1 hit for monomerid = 50412372
TargetSalicyl-AMP ligase / salicyl-S-ArCP synthetase(Mycobacterium tuberculosis)
University Of Minnesota
Curated by ChEMBL
LigandPNGBDBM50412372(CHEMBL459678)
Affinity DataKi:  1.14E+3nM. Assay description: Inhibition of Mycobacterium tuberculosis recombinant MbtA expressed in Escherichia coli by ATP-PPi exchange assay
In DepthDetails ArticlePubMed