BDBM50412948 CHEMBL480248
SMILES CN(Cc1c(nc2ccccc2c1C(=O)N[C@@H](C1CC1)c1cccc(F)c1)-c1cccc(F)c1)S(C)(=O)=O
InChI Key InChIKey=YFBSHPOZGNZJOC-MHZLTWQESA-N
Data  1 KI
  Tab Delimited (TSV)   2D SDfile   Computed 3D by Vconf -m prep SDfile
Find this compound or compounds like it in BindingDB:
Activity Spreadsheet -- Enzyme Inhibition Constant Data from BindingDB
Found 1 hit for monomerid = 50412948
TargetNeuromedin-K receptor(Homo sapiens (Human))
Neuroscience Cedd Glaxosmithkline Research & Development
Curated by ChEMBL
LigandPNGBDBM50412948(CHEMBL480248)
Affinity DataKi:  6.31nM. Assay description: Binding affinity to NK3 receptor
In DepthDetails ArticlePubMed