BDBM50412952 CHEMBL480628::GSK-172981
SMILES Nc1c(nc2ccccc2c1C(=O)N[C@@H](C1CC1)c1ccccc1)-c1cccc(F)c1
InChI Key InChIKey=ZKGNLARKIMWKFE-XMMPIXPASA-N
Data  1 KI
  Tab Delimited (TSV)   2D SDfile   Computed 3D by Vconf -m prep SDfile
Find this compound or compounds like it in BindingDB:
Activity Spreadsheet -- Enzyme Inhibition Constant Data from BindingDB
Found 1 hit for monomerid = 50412952
TargetNeuromedin-K receptor(Homo sapiens (Human))
Neuroscience Cedd Glaxosmithkline Research & Development
Curated by ChEMBL
LigandPNGBDBM50412952(CHEMBL480628 | GSK-172981)
Affinity DataKi:  10nM. Assay description: Binding affinity to NK3 receptor
In DepthDetails ArticlePubMed