BDBM50413159 CHEMBL488395
SMILES OC(=O)CCc1ccc(cc1)C#Cc1cccc(C=O)c1
InChI Key InChIKey=HNJARUWHHARXIC-UHFFFAOYSA-N
Data  1 EC50
  Tab Delimited (TSV)   2D SDfile   Computed 3D by Vconf -m prep SDfile
Find this compound or compounds like it in BindingDB:
Activity Spreadsheet -- Enzyme Inhibition Constant Data from BindingDB
Found 1 hit for monomerid = 50413159
TargetFree fatty acid receptor 1(Homo sapiens (Human))
University Of Southern Denmark
Curated by ChEMBL
LigandPNGBDBM50413159(CHEMBL488395)
Affinity DataEC50:  355nM. Assay description: Agonist activity at human FFA1 expressed in human 1321N1 cells by calcium fluorescence assay
In DepthDetails ArticlePubMed