BDBM50413187 CHEMBL612058
SMILES Nc1ncnc2n(cnc12)C1OC(COS(=O)(=O)NCc2ccccc2O)C(O)C1O
InChI Key InChIKey=HCYJFNRTOTXSQG-UHFFFAOYSA-N
Data  1 KI
  Tab Delimited (TSV)   2D SDfile   Computed 3D by Vconf -m prep SDfile
Find this compound or compounds like it in BindingDB:
Activity Spreadsheet -- Enzyme Inhibition Constant Data from BindingDB
Found 1 hit for monomerid = 50413187
TargetSalicyl-AMP ligase / salicyl-S-ArCP synthetase(Mycobacterium tuberculosis)
University Of Minnesota
Curated by ChEMBL
LigandPNGBDBM50413187(CHEMBL612058)
Affinity DataKi:  410nM. Assay description: Inhibition of Mycobacterium tuberculosis BAG RV143 MbtA expressed in Escherichia coli BL21 (DE3) assessed as ATP-[32P]PPi exchange by liquid scintill...
In DepthDetails ArticlePubMed