BDBM50413193 CHEMBL611787
SMILES Nc1ncnc2n(cnc12)C1CC(COS(=O)(=O)NC(=O)c2ccccc2O)C=C1
InChI Key InChIKey=OGPMPBKHTVYOOM-UHFFFAOYSA-N
Data  1 KI
  Tab Delimited (TSV)   2D SDfile   Computed 3D by Vconf -m prep SDfile
Find this compound or compounds like it in BindingDB:
Activity Spreadsheet -- Enzyme Inhibition Constant Data from BindingDB
Found 1 hit for monomerid = 50413193
TargetSalicyl-AMP ligase / salicyl-S-ArCP synthetase(Mycobacterium tuberculosis)
University Of Minnesota
Curated by ChEMBL
LigandPNGBDBM50413193(CHEMBL611787)
Affinity DataKi:  830nM. Assay description: Inhibition of Mycobacterium tuberculosis BAG RV143 MbtA expressed in Escherichia coli BL21 (DE3) assessed as ATP-[32P]PPi exchange by liquid scintill...
In DepthDetails ArticlePubMed