BDBM50413814 CHEMBL472886
SMILES OC1C(O)C(OC1C(=O)NCCc1ccccc1)n1cnc2c(NCc3cccc(I)c3)nc(Cl)nc12
InChI Key InChIKey=PSOXNKBDPMUBIO-UHFFFAOYSA-N
Data  1 KI
  Tab Delimited (TSV)   2D SDfile   Computed 3D by Vconf -m prep SDfile
Find this compound or compounds like it in BindingDB:
Activity Spreadsheet -- Enzyme Inhibition Constant Data from BindingDB
Found 1 hit for monomerid = 50413814
TargetAdenosine receptor A3(Homo sapiens (Human))
Sobhasaria Engineering College
Curated by ChEMBL
LigandPNGBDBM50413814(CHEMBL472886)
Affinity DataKi:  437nM. Assay description: Displacement of [125I]I-AB-MEAC from human adenosine A3 receptor expressed in CHO cells
In DepthDetails ArticlePubMed